Reaction Details
TargetMitotic checkpoint serine/threonine-protein kinase BUB1
LigandBDBM378960
Substrate/Competitorn/a
Meas. Tech.Bub1 Kinase Assay
IC50 4.50±n/a nM
Citation Hitchcock, MMengel, APütter, VSiemeister, GWengner, AMBriem, HEis, KSchulze, VFernandez-Montalvan, AEPrechtl, SHolton, SFanghänel, JLienau, PPreusse, CGnoth, MJ Substituted benzylindazoles for use as Bub1 kinase inhibitors in the treatment of hyperproliferative diseases US Patent US10266548 Publication Date 4/23/2019
 
Mitotic checkpoint serine/threonine-protein kinase BUB1
Name:Mitotic checkpoint serine/threonine-protein kinase BUB1
Type:PROTEIN
Mol. Mass.:122372.31
Organism:Homo sapiens (Human)
Description:ChEMBL_1510603
Residue:1085
BDBM378960
NameBDBM378960
Synonyms:2-[1-(2,6- difluoro-3- methoxybenzyl)- 1H-indazol-3-yl]- 5-methoxy-N- (pyridin-4- yl)pyrimidin-4- amine | US10266548, Example 2-4-1
TypeSmall organic molecule
Emp. Form.C25H22F2N6O2
Mol. Mass.476.478
SMILESCOc1ccc(F)c(CN(\N=C\c2ncc(OC)c(Nc3ccncc3)n2)c2ccccc2)c1F