Reaction Details
TargetMitotic checkpoint serine/threonine-protein kinase BUB1
LigandBDBM379026
Substrate/Competitorn/a
Meas. Tech.Bub1 Kinase Assay
IC50 3.00±n/a nM
Citation Hitchcock, MMengel, APütter, VSiemeister, GWengner, AMBriem, HEis, KSchulze, VFernandez-Montalvan, AEPrechtl, SHolton, SFanghänel, JLienau, PPreusse, CGnoth, MJ Substituted benzylindazoles for use as Bub1 kinase inhibitors in the treatment of hyperproliferative diseases US Patent US10266548 Publication Date 4/23/2019
 
Mitotic checkpoint serine/threonine-protein kinase BUB1
Name:Mitotic checkpoint serine/threonine-protein kinase BUB1
Type:PROTEIN
Mol. Mass.:122372.31
Organism:Homo sapiens (Human)
Description:ChEMBL_1510603
Residue:1085
BDBM379026
NameBDBM379026
Synonyms:Preparation of 1-[3,5-difluoro-4-({3-[5-methoxy-4-(pyridin-4-ylamino)pyrimidin-2-yl]-1H-indazol-1-yl}methyl)phenyl]ethanone | US10266548, Example 7-1
TypeSmall organic molecule
Emp. Form.C26H20F2N6O2
Mol. Mass.486.4728
SMILESCOc1cnc(nc1Nc1ccncc1)-c1nn(Cc2c(F)cc(cc2F)C(C)=O)c2ccccc12