Reaction Details
TargetMitotic checkpoint serine/threonine-protein kinase BUB1
LigandBDBM379045
Substrate/Competitorn/a
Meas. Tech.Bub1 Kinase Assay
IC50 4.70±n/a nM
Citation Hitchcock, MMengel, APütter, VSiemeister, GWengner, AMBriem, HEis, KSchulze, VFernandez-Montalvan, AEPrechtl, SHolton, SFanghänel, JLienau, PPreusse, CGnoth, MJ Substituted benzylindazoles for use as Bub1 kinase inhibitors in the treatment of hyperproliferative diseases US Patent US10266548 Publication Date 4/23/2019
 
Mitotic checkpoint serine/threonine-protein kinase BUB1
Name:Mitotic checkpoint serine/threonine-protein kinase BUB1
Type:PROTEIN
Mol. Mass.:122372.31
Organism:Homo sapiens (Human)
Description:ChEMBL_1510603
Residue:1085
BDBM379045
NameBDBM379045
Synonyms:4-({2-[1-(2- fluorobenzyl)- 1H-indazol-3-yl]- 5-(2- hydroxyethoxy)- pyrimidin-4- yl}amino)-N- methylpyridine- 3-carboxamide | US10266548, Example 13-4
TypeSmall organic molecule
Emp. Form.C27H24FN7O3
Mol. Mass.513.523
SMILESCNC(=O)c1cnccc1Nc1nc(ncc1OCCO)-c1nn(Cc2ccccc2F)c2ccccc12