Reaction Details
TargetLysine-specific histone demethylase 1A
LigandBDBM261744
Substrate/Competitorn/a
Meas. Tech.Monoamine Oxidase Assays
Ki 500±n/a nM
Citation Ortega Muñoz, AFyfe, MCMartinell Pedemonte, MTirapu Fernandez De La Cuesta, IEstiarte-Martinez, M Arylcyclopropylamine based demethylase inhibitors of LSD1 and their medical use US Patent US9708309 Publication Date 7/18/2017
 
Lysine-specific histone demethylase 1A
Name:Lysine-specific histone demethylase 1A
Type:Enzyme
Mol. Mass.:92901.01
Organism:Homo sapiens (Human)
Description:O60341
Residue:852
BDBM261744
NameBDBM261744
Synonyms:US10233178, Example 11 | US9708309, 11
TypeSmall organic molecule
Emp. Form.C19H19FN4O2
Mol. Mass.354.3782
SMILESNc1nnc(CN[C@H]2C[C@@H]2c2ccc(OCc3ccc(F)cc3)cc2)o1