Reaction Details
TargetDihydroorotate dehydrogenase (quinone), mitochondrial
LigandBDBM24409
Substrate/CompetitorBDBM15346
Meas. Tech.DHODH Inhibition Assay
pH8±n/a
Temperature293.15±n/a K
IC50 330±100 nM
Citation Phillips, MAGujjar, RMalmquist, NAWhite, JEl Mazouni, FBaldwin, JRathod, PK Triazolopyrimidine-based dihydroorotate dehydrogenase inhibitors with potent and selective activity against the malaria parasite Plasmodium falciparum. J Med Chem51:3649-53 (2008) 
 
Dihydroorotate dehydrogenase (quinone), mitochondrial
Name:Dihydroorotate dehydrogenase (quinone), mitochondrial
Type:Enzyme
Mol. Mass.:65581.88
Organism:Plasmodium falciparum (isolate 3D7)
Description:Q08210
Residue:569
BDBM24409
BDBM15346
NameBDBM24409
Synonyms:3-({5-methyl-[1,2,4]triazolo[1,5-a]pyrimidin-7-yl}amino)naphthalen-2-ol | Triazolopyrimidine-Based Compound, 16
TypeSmall organic molecule
Emp. Form.C16H13N5O
Mol. Mass.291.3073
SMILESCc1cc(Nc2cc3ccccc3cc2O)n2ncnc2n1