Reaction Details
TargetPolyunsaturated fatty acid 5-lipoxygenase
LigandBDBM24561
Substrate/CompetitorBDBM22319
Meas. Tech.Determination of 5-LO Product Formation in Cell-Free Systems (IC50).
pH7.4±n/a
Temperature310.15±n/a K
IC50 19000±n/a nM
EC50 600±n/a nM
Citation Werz, OGreiner, CKoeberle, AHoernig, CGeorge, SPopescu, LSyha, ISchubert-Zsilavecz, MSteinhilber, D Novel and potent inhibitors of 5-lipoxygenase product synthesis based on the structure of pirinixic acid. J Med Chem51:5449-53 (2008) 
 
Polyunsaturated fatty acid 5-lipoxygenase
Name:Polyunsaturated fatty acid 5-lipoxygenase
Type:Enzyme
Mol. Mass.:77972.74
Organism:Homo sapiens (Human)
Description:Recombinant protein was purified from E. coli lysate. After ammonium sulfate precipitation and subsequent steps, the supernatant (S100) was used for 5-LO activity assay.
Residue:674
BDBM24561
BDBM22319
NameBDBM24561
Synonyms:CHEMBL459722 ethyl 2-{[4-chloro-6-(quinolin-6-ylamino)pyrimidin-2-yl]sulfanyl}octanoate
TypeSmall organic molecule
Emp. Form.C23H27ClN4O2S
Mol. Mass.459.004
SMILESCCCCCCC(Sc1nc(Cl)cc(Nc2ccc3ncccc3c2)n1)C(=O)OCC