Reaction Details
TargetDNA gyrase subunit A/B
LigandBDBM24605
Substrate/CompetitorBDBM2
Meas. Tech.DNA Gyrase ATPase Assay
pH7.5±n/a
Temperature303.15±n/a K
Ki 81±n/a nM
Citation Charifson, PSGrillot, ALGrossman, THParsons, JDBadia, MBellon, SDeininger, DDDrumm, JEGross, CHLeTiran, ALiao, YMani, NNicolau, DPPerola, ERonkin, SShannon, DSwenson, LLTang, QTessier, PRTian, SKTrudeau, MWang, TWei, YZhang, HStamos, D Novel dual-targeting benzimidazole urea inhibitors of DNA gyrase and topoisomerase IV possessing potent antibacterial activity: intelligent design and evolution through the judicious use of structure-guided design and structure-activity relationships. J Med Chem51:5243-63 (2008) 
 
DNA gyrase subunit A/B
Name:DNA gyrase subunit A/B
Synonyms:DNA Gyrase
Type:A2B2 tetramer
Mol. Mass.:n/a
Description:n/a
Components:This complex has 2 components.
Component 1
Name:DNA gyrase subunit A
Type:Enzyme Subunit
Mol. Mass.:99588.82
Organism:Staphylococcus aureus
Description:n/a
Residue:889
Component 2
Name:DNA gyrase subunit B
Synonyms:DNA gyrase DNA gyrase subunit B (gyrB) gyrB
Type:Enzyme Subunit
Mol. Mass.:72530.91
Organism:Staphylococcus aureus
Description:n/a
Residue:644
BDBM24605
BDBM2
NameBDBM24605
Synonyms:3-ethyl-1-[6-(piperidin-1-yl)-5-(pyridin-3-yl)-1H-1,3-benzodiazol-2-yl]urea | Benzimidazole urea analogue, 9
TypeSmall organic molecule
Emp. Form.C20H24N6O
Mol. Mass.364.4442
SMILESCCNC(=O)Nc1nc2cc(-c3cccnc3)c(cc2[nH]1)N1CCCCC1