Reaction Details
TargetDNA gyrase subunit A/B
LigandBDBM24607
Substrate/CompetitorBDBM2
Meas. Tech.DNA Gyrase ATPase Assay
pH7.5±n/a
Temperature303.15±n/a K
Ki 26±n/a nM
Citation Charifson, PSGrillot, ALGrossman, THParsons, JDBadia, MBellon, SDeininger, DDDrumm, JEGross, CHLeTiran, ALiao, YMani, NNicolau, DPPerola, ERonkin, SShannon, DSwenson, LLTang, QTessier, PRTian, SKTrudeau, MWang, TWei, YZhang, HStamos, D Novel dual-targeting benzimidazole urea inhibitors of DNA gyrase and topoisomerase IV possessing potent antibacterial activity: intelligent design and evolution through the judicious use of structure-guided design and structure-activity relationships. J Med Chem51:5243-63 (2008) 
 
DNA gyrase subunit A/B
Name:DNA gyrase subunit A/B
Synonyms:DNA Gyrase
Type:A2B2 tetramer
Mol. Mass.:n/a
Description:n/a
Components:This complex has 2 components.
Component 1
Name:DNA gyrase subunit A
Type:Enzyme Subunit
Mol. Mass.:99588.82
Organism:Staphylococcus aureus
Description:n/a
Residue:889
Component 2
Name:DNA gyrase subunit B
Synonyms:DNA gyrase DNA gyrase subunit B (gyrB) gyrB
Type:Enzyme Subunit
Mol. Mass.:72530.91
Organism:Staphylococcus aureus
Description:n/a
Residue:644
BDBM24607
BDBM2
NameBDBM24607
Synonyms:2-[(ethylcarbamoyl)amino]-N-methyl-5-(pyridin-3-yl)-1H-1,3-benzodiazole-7-carboxamide | Benzimidazole urea analogue, 11
TypeSmall organic molecule
Emp. Form.C17H18N6O2
Mol. Mass.338.3638
SMILESCCNC(=O)Nc1nc2cc(cc(C(=O)NC)c2[nH]1)-c1cccnc1