Reaction Details
TargetDNA gyrase subunit A/B
LigandBDBM24612
Substrate/CompetitorBDBM2
Meas. Tech.DNA Gyrase ATPase Assay
pH7.5±n/a
Temperature303.15±n/a K
Ki 35±n/a nM
Citation Charifson, PSGrillot, ALGrossman, THParsons, JDBadia, MBellon, SDeininger, DDDrumm, JEGross, CHLeTiran, ALiao, YMani, NNicolau, DPPerola, ERonkin, SShannon, DSwenson, LLTang, QTessier, PRTian, SKTrudeau, MWang, TWei, YZhang, HStamos, D Novel dual-targeting benzimidazole urea inhibitors of DNA gyrase and topoisomerase IV possessing potent antibacterial activity: intelligent design and evolution through the judicious use of structure-guided design and structure-activity relationships. J Med Chem51:5243-63 (2008) 
 
DNA gyrase subunit A/B
Name:DNA gyrase subunit A/B
Synonyms:DNA Gyrase
Type:A2B2 tetramer
Mol. Mass.:n/a
Description:n/a
Components:This complex has 2 components.
Component 1
Name:DNA gyrase subunit A
Type:Enzyme Subunit
Mol. Mass.:99588.82
Organism:Staphylococcus aureus
Description:n/a
Residue:889
Component 2
Name:DNA gyrase subunit B
Synonyms:DNA gyrase DNA gyrase subunit B (gyrB) gyrB
Type:Enzyme Subunit
Mol. Mass.:72530.91
Organism:Staphylococcus aureus
Description:n/a
Residue:644
BDBM24612
BDBM2
NameBDBM24612
Synonyms:1-[7-(benzyloxy)-5-(pyridin-3-yl)-1H-1,3-benzodiazol-2-yl]-3-ethylurea | Benzimidazole urea analogue, 16
TypeSmall organic molecule
Emp. Form.C22H21N5O2
Mol. Mass.387.4344
SMILESCCNC(=O)Nc1nc2cc(cc(OCc3ccccc3)c2[nH]1)-c1cccnc1