Reaction Details
TargetDNA gyrase subunit A/B
LigandBDBM24616
Substrate/CompetitorBDBM2
Meas. Tech.DNA Gyrase ATPase Assay
Ki<4±n/a nM
Citation Charifson, PSGrillot, ALGrossman, THParsons, JDBadia, MBellon, SDeininger, DDDrumm, JEGross, CHLeTiran, ALiao, YMani, NNicolau, DPPerola, ERonkin, SShannon, DSwenson, LLTang, QTessier, PRTian, SKTrudeau, MWang, TWei, YZhang, HStamos, D Novel dual-targeting benzimidazole urea inhibitors of DNA gyrase and topoisomerase IV possessing potent antibacterial activity: intelligent design and evolution through the judicious use of structure-guided design and structure-activity relationships. J Med Chem51:5243-63 (2008) 
 
DNA gyrase subunit A/B
Name:DNA gyrase subunit A/B
Type:A2B2 tetramer
Mol. Mass.:n/a
Description:n/a
Components:This complex has 2 components.
Component 1
Name:DNA gyrase subunit A
Synonyms:DNA gyrase GYRA_ECOLI hisW parD
Type:Enzyme Subunit
Mol. Mass.:96935.15
Organism:Escherichia coli (strain K12)
Description:n/a
Residue:875
Component 2
Name:DNA gyrase subunit B
Synonyms:DNA gyrase subunit B GYRB_ECOLI acrB gyrB hisU parA | pcbA
Type:Enzyme Subunit
Mol. Mass.:89941.28
Organism:Escherichia coli (strain K12)
Description:P0AES6
Residue:804
BDBM24616
BDBM2
NameBDBM24616
Synonyms:1-(6-(4-(Cyclopropylcarbamoyl)-1H-imidazol-1-yl)-4-(pyridin-2-yl)-1H-benzo[d]imidazol-2-yl)-3-ethylurea N-cyclopropyl-1-{2-[(ethylcarbamoyl)amino]-7-(pyridin-2-yl)-1H-1,3-benzodiazol-5-yl}-1H-imidazole-4-carboxamide
TypeSmall organic molecule
Emp. Form.C22H22N8O2
Mol. Mass.430.4625
SMILESCCNC(=O)Nc1nc2c(cc(cc2[nH]1)-n1cnc(c1)C(=O)NC1CC1)-c1ccccn1