Reaction Details
TargetDNA topoisomerase 4 subunit A/B
LigandBDBM24613
Substrate/CompetitorBDBM2
Meas. Tech.DNA Gyrase ATPase Assay
Ki 680±n/a nM
Citation Charifson, PSGrillot, ALGrossman, THParsons, JDBadia, MBellon, SDeininger, DDDrumm, JEGross, CHLeTiran, ALiao, YMani, NNicolau, DPPerola, ERonkin, SShannon, DSwenson, LLTang, QTessier, PRTian, SKTrudeau, MWang, TWei, YZhang, HStamos, D Novel dual-targeting benzimidazole urea inhibitors of DNA gyrase and topoisomerase IV possessing potent antibacterial activity: intelligent design and evolution through the judicious use of structure-guided design and structure-activity relationships. J Med Chem51:5243-63 (2008) 
 
DNA topoisomerase 4 subunit A/B
Name:DNA topoisomerase 4 subunit A/B
Synonyms:DNA Topoisomerase IV
Type:C2E2 tetramer
Mol. Mass.:n/a
Description:n/a
Components:This complex has 2 components.
Component 1
Name:DNA topoisomerase 4 subunit A
Type:Enzyme Subunit
Mol. Mass.:83831.33
Organism:Escherichia coli (strain K12)
Description:n/a
Residue:752
Component 2
Name:DNA topoisomerase 4 subunit B
Synonyms:DNA Topoisomerase IV Subunit B PARE_ECOLI parE
Type:Enzyme Subunit
Mol. Mass.:70233.03
Organism:Escherichia coli (strain K12)
Description:n/a
Residue:630
BDBM24613
BDBM2
NameBDBM24613
Synonyms:3-ethyl-1-[6-methoxy-5-(2-methoxypyrimidin-5-yl)-1H-1,3-benzodiazol-2-yl]urea | Benzimidazole urea analogue, 17
TypeSmall organic molecule
Emp. Form.C16H18N6O3
Mol. Mass.342.3525
SMILESCCNC(=O)Nc1nc2cc(c(OC)cc2[nH]1)-c1cnc(OC)nc1