Reaction Details
TargetHistone deacetylase 1
LigandBDBM24621
Substrate/CompetitorBDBM24619
Meas. Tech.HDAC Inhibition Assay
pH7.4±n/a
Temperature295.15±n/a K
Ki 4±n/a nM
Citation Buggy, JJCao, ZABass, KEVerner, EBalasubramanian, SLiu, LSchultz, BEYoung, PRDalrymple, SA CRA-024781: a novel synthetic inhibitor of histone deacetylase enzymes with antitumor activity in vitro and in vivo. Mol Cancer Ther5:1309-17 (2006) 
 
Histone deacetylase 1
Name:Histone deacetylase 1
Type:Enzyme
Mol. Mass.:55090.27
Organism:Homo sapiens (Human)
Description:Q13547
Residue:482
BDBM24621
BDBM24619
NameBDBM24621
Synonyms:CG-003 | N-{2-[4-(hydroxycarbamoyl)phenoxy]ethyl}-1-benzofuran-2-carboxamide
TypeSmall organic molecule
Emp. Form.C18H16N2O5
Mol. Mass.340.33
SMILESONC(=O)c1ccc(OCCNC(=O)c2cc3ccccc3o2)cc1