Reaction Details
TargetHistone deacetylase 11
LigandBDBM24624
Substrate/CompetitorBDBM19411
Meas. Tech.HDAC Enzyme Inhibition Assay
pH8±n/a
Temperature310.15±n/a K
IC50 590±230 nM
Citation Zhou, NMoradei, ORaeppel, SLeit, SFrechette, SGaudette, FPaquin, IBernstein, NBouchain, GVaisburg, AJin, ZGillespie, JWang, JFournel, MYan, PTTrachy-Bourget, MCKalita, ALu, ARahil, JMacLeod, ARLi, ZBesterman, JMDelorme, D Discovery of N-(2-aminophenyl)-4-[(4-pyridin-3-ylpyrimidin-2-ylamino)methyl]benzamide (MGCD0103), an orally active histone deacetylase inhibitor. J Med Chem51:4072-5 (2008) 
 
Histone deacetylase 11
Name:Histone deacetylase 11
Type:Chromatin regulator; hydrolase; repressor
Mol. Mass.:39187.66
Organism:Homo sapiens (Human)
Description:Q96DB2
Residue:347
BDBM24624
BDBM19411
NameBDBM24624
Synonyms:CHEMBL272980 MGCD0103 US10227295, Compound MGCD0103 US9409858, MGCD0103 US9956192, Compound MGCD0103
TypeSmall organic molecule
Emp. Form.C23H20N6O
Mol. Mass.396.4445
SMILESNc1ccccc1NC(=O)c1ccc(CNc2nccc(n2)-c2cccnc2)cc1