Reaction Details
TargetIndoleamine 2,3-dioxygenase 1
LigandBDBM24667
Substrate/CompetitorBDBM21974
Meas. Tech.Enzyme Inhibition Assay
pH6.5±n/a
Temperature310.15±n/a K
IC50 25000±n/a nM
Citation Kumar, SJaller, DPatel, BLaLonde, JMDuHadaway, JBMalachowski, WPPrendergast, GCMuller, AJ Structure based development of phenylimidazole-derived inhibitors of indoleamine 2,3-dioxygenase. J Med Chem51:4968-77 (2008) 
 
Indoleamine 2,3-dioxygenase 1
Name:Indoleamine 2,3-dioxygenase 1
Type:Enzyme
Mol. Mass.:45330.80
Organism:Homo sapiens (Human)
Description:P14902
Residue:403
BDBM24667
BDBM21974
NameBDBM24667
Synonyms:2-(1H-imidazol-4-yl)benzene-1-thiol | 2-(1H-imidazol-4-yl)benzenethiol, 16
TypeSmall organic molecule
Emp. Form.C9H8N2S
Mol. Mass.176.238
SMILESSc1ccccc1-c1c[nH]cn1