Reaction Details
TargetIndoleamine 2,3-dioxygenase 1
LigandBDBM24670
Substrate/CompetitorBDBM21974
Meas. Tech.Enzyme Inhibition Assay
pH6.5±n/a
Temperature310.15±n/a K
IC50 73000±n/a nM
Citation Kumar, SJaller, DPatel, BLaLonde, JMDuHadaway, JBMalachowski, WPPrendergast, GCMuller, AJ Structure based development of phenylimidazole-derived inhibitors of indoleamine 2,3-dioxygenase. J Med Chem51:4968-77 (2008) 
 
Indoleamine 2,3-dioxygenase 1
Name:Indoleamine 2,3-dioxygenase 1
Type:Enzyme
Mol. Mass.:45330.80
Organism:Homo sapiens (Human)
Description:P14902
Residue:403
BDBM24670
BDBM21974
NameBDBM24670
Synonyms:4-[3-(methylsulfanyl)phenyl]-1H-imidazole | 4-[3-(methylsulfanyl)phenyl]-1H-imidazole, 14
TypeSmall organic molecule
Emp. Form.C10H10N2S
Mol. Mass.190.265
SMILESCSc1cccc(c1)-c1c[nH]cn1