Reaction Details
TargetTrifunctional purine biosynthetic protein adenosine-3
LigandBDBM24690
Substrate/CompetitorBDBM22589
Meas. Tech.GAR Tfase Activity Assay
pH7.5±n/a
Temperature299.15±n/a K
Ki 1200±n/a nM
Citation DeMartino, JKHwang, IConnelly, SWilson, IABoger, DL Asymmetric synthesis of inhibitors of glycinamide ribonucleotide transformylase. J Med Chem51:5441-8 (2008) 
 
Trifunctional purine biosynthetic protein adenosine-3
Name:Trifunctional purine biosynthetic protein adenosine-3
Type:Protein
Mol. Mass.:107768.47
Organism:Homo sapiens (Human)
Description:P22102
Residue:1010
BDBM24690
BDBM22589
NameBDBM24690
Synonyms:10-methoxy-DDACTHF, 10S-8 | 2-({4-[(1S)-4-(2,4-diamino-6-oxo-1,6-dihydropyrimidin-5-yl)-1-methoxybutyl]phenyl}formamido)pentanedioic acid
TypeSmall organic molecule
Emp. Form.C21H27N5O7
Mol. Mass.461.4684
SMILESCO[C@@H](CCCc1c(N)nc(N)[nH]c1=O)c1ccc(cc1)C(=O)NC(CCC(O)=O)C(O)=O