Reaction Details
TargetCoagulation factor XII
LigandBDBM24710
Substrate/CompetitorBDBM22723
Meas. Tech.Enzyme Inhibition Assay
pH7.4±n/a
Temperature295.15±n/a K
Ki>100000±n/a nM
Citation Bencharit, SMorton, CLHyatt, JLKuhn, PDanks, MKPotter, PMRedinbo, MR Crystal structure of human carboxylesterase 1 complexed with the Alzheimer's drug tacrine: from binding promiscuity to selective inhibition. Chem Biol10:341-9 (2003) 
 
Coagulation factor XII
Name:Coagulation factor XII
Type:Enzyme
Mol. Mass.:67810.07
Organism:Homo sapiens (Human)
Description:P00748
Residue:615
BDBM24710
BDBM22723
NameBDBM24710
Synonyms:6-chloro-2-methoxyacridin-9-amine | 9-Amino-6-Chloro-2-Methoxyacridine
TypeSmall organic molecule
Emp. Form.C14H11ClN2O
Mol. Mass.258.703
SMILESCOc1ccc2nc3cc(Cl)ccc3c(N)c2c1