Reaction Details
TargetIndoleamine 2,3-dioxygenase 1
LigandBDBM24777
Substrate/CompetitorBDBM21974
Meas. Tech.Enzyme Inhibition Assay
pH6.5±n/a
Temperature310.15±n/a K
IC50 1000±n/a nM
Citation Kumar, SMalachowski, WPDuHadaway, JBLaLonde, JMCarroll, PJJaller, DMetz, RPrendergast, GCMuller, AJ Indoleamine 2,3-dioxygenase is the anticancer target for a novel series of potent naphthoquinone-based inhibitors. J Med Chem51:1706-18 (2008) 
 
Indoleamine 2,3-dioxygenase 1
Name:Indoleamine 2,3-dioxygenase 1
Type:Enzyme
Mol. Mass.:45330.80
Organism:Homo sapiens (Human)
Description:P14902
Residue:403
BDBM24777
BDBM21974
NameBDBM24777
Synonyms:5-hydroxy-1,4-dihydronaphthalene-1,4-dione CHEMBL43612 Juglone (6a)
TypeSmall organic molecule
Emp. Form.C10H6O3
Mol. Mass.174.1528
SMILESOc1cccc2C(=O)C=CC(=O)c12