Reaction Details
TargetIndoleamine 2,3-dioxygenase 1
LigandBDBM24785
Substrate/CompetitorBDBM21974
Meas. Tech.Enzyme Inhibition Assay
pH6.5±n/a
Temperature310.15±n/a K
IC50 340±n/a nM
Citation Kumar, SMalachowski, WPDuHadaway, JBLaLonde, JMCarroll, PJJaller, DMetz, RPrendergast, GCMuller, AJ Indoleamine 2,3-dioxygenase is the anticancer target for a novel series of potent naphthoquinone-based inhibitors. J Med Chem51:1706-18 (2008) 
 
Indoleamine 2,3-dioxygenase 1
Name:Indoleamine 2,3-dioxygenase 1
Type:Enzyme
Mol. Mass.:45330.80
Organism:Homo sapiens (Human)
Description:P14902
Residue:403
BDBM24785
BDBM21974
NameBDBM24785
Synonyms:(2S)-2-amino-4-{[(1R)-1-[(carboxymethyl)carbamoyl]-2-[(1,4-dihydroxy-3-methylnaphthalen-2-yl)sulfanyl]ethyl]carbamoyl}butanoic acid | Hydroquinone derivative, 14
TypeSmall organic molecule
Emp. Form.C21H25N3O8S
Mol. Mass.479.504
SMILESCc1c(O)c2ccccc2c(O)c1SC[C@H](NC(=O)CC[C@H](N)C(O)=O)C(=O)NCC(O)=O