Reaction Details
TargetIndoleamine 2,3-dioxygenase 1
LigandBDBM24800
Substrate/CompetitorBDBM21974
Meas. Tech.Enzyme Inhibition Assay
IC50 183±n/a nM
Citation Kumar, SMalachowski, WPDuHadaway, JBLaLonde, JMCarroll, PJJaller, DMetz, RPrendergast, GCMuller, AJ Indoleamine 2,3-dioxygenase is the anticancer target for a novel series of potent naphthoquinone-based inhibitors. J Med Chem51:1706-18 (2008) 
 
Indoleamine 2,3-dioxygenase 1
Name:Indoleamine 2,3-dioxygenase 1
Type:Enzyme
Mol. Mass.:45330.80
Organism:Homo sapiens (Human)
Description:P14902
Residue:403
BDBM24800
BDBM21974
NameBDBM24800
Synonyms:(3R,4S)-3-hydroxy-2,2-dimethyl-4-(prop-2-en-1-ylamino)-2H,3H,4H,5H,10H-naphtho[2,3-b]pyran-5,10-dione | Pyranonaphthoquinone derivative, 39
TypeSmall organic molecule
Emp. Form.C18H19NO4
Mol. Mass.313.3478
SMILESCC1(C)OC2=C([C@H](NCC=C)[C@H]1O)C(=O)c1ccccc1C2=O