Reaction Details
TargetIndoleamine 2,3-dioxygenase 1
LigandBDBM24804
Substrate/CompetitorBDBM21974
Meas. Tech.Enzyme Inhibition Assay
IC50 361±n/a nM
Citation Kumar, SMalachowski, WPDuHadaway, JBLaLonde, JMCarroll, PJJaller, DMetz, RPrendergast, GCMuller, AJ Indoleamine 2,3-dioxygenase is the anticancer target for a novel series of potent naphthoquinone-based inhibitors. J Med Chem51:1706-18 (2008) 
 
Indoleamine 2,3-dioxygenase 1
Name:Indoleamine 2,3-dioxygenase 1
Type:Enzyme
Mol. Mass.:45330.80
Organism:Homo sapiens (Human)
Description:P14902
Residue:403
BDBM24804
BDBM21974
NameBDBM24804
Synonyms:(3R,4S)-3-hydroxy-2,2-dimethyl-4-(morpholin-4-yl)-2H,3H,4H,5H,10H-naphtho[2,3-b]pyran-5,10-dione | Pyranonaphthoquinone derivative, 43
TypeSmall organic molecule
Emp. Form.C19H21NO5
Mol. Mass.343.3737
SMILESCC1(C)OC2=C([C@@H]([C@H]1O)N1CCOCC1)C(=O)c1ccccc1C2=O