Reaction Details
TargetIndoleamine 2,3-dioxygenase 1
LigandBDBM24834
Substrate/CompetitorBDBM21974
Meas. Tech.Enzyme Inhibition Assay
pH6.5±n/a
Temperature310.15±n/a K
Ki 202000±n/a nM
Citation Gaspari, PBanerjee, TMalachowski, WPMuller, AJPrendergast, GCDuHadaway, JBennett, SDonovan, AM Structure-activity study of brassinin derivatives as indoleamine 2,3-dioxygenase inhibitors. J Med Chem49:684-92 (2006) 
 
Indoleamine 2,3-dioxygenase 1
Name:Indoleamine 2,3-dioxygenase 1
Type:Enzyme
Mol. Mass.:45330.80
Organism:Homo sapiens (Human)
Description:P14902
Residue:403
BDBM24834
BDBM21974
NameBDBM24834
Synonyms:N-(1H-indol-3-ylmethyl)propanethioamide | thioamide, 22
TypeSmall organic molecule
Emp. Form.C12H14N2S
Mol. Mass.218.318
SMILESCCC(=S)NCc1c[nH]c2ccccc12