Reaction Details
TargetFatty acid synthase [2202-2509]
LigandBDBM24984
Substrate/CompetitorBDBM24568
Meas. Tech.Fluorogenic Assay for Detection of FASTE Inhibition
pH7.5±n/a
Temperature310.15±n/a K
Ki 380±100 nM
Citation Richardson, RDSmith, JW Novel antagonists of the thioesterase domain of human fatty acid synthase. Mol Cancer Ther6:2120-6 (2007) 
 
Fatty acid synthase [2202-2509]
Name:Fatty acid synthase [2202-2509]
Type:Thioesterase domain
Mol. Mass.:33927.11
Organism:Homo sapiens (Human)
Description:The recombinant thioesterase domain (residues 2202-2509) of FAS was cloned and expressed in Escheria coli. The thioesterase was purified by Ni-affinity chromatography, and analyzed for activity and inhibition by Orlistat.
Residue:308
BDBM24984
BDBM24568
NameBDBM24984
Synonyms:(5E)-1-(3,5-dimethylphenyl)-5-[(5-phenylfuran-2-yl)methylidene]-1,3-diazinane-2,4,6-trione | 5-(furan-2-ylmethylene) pyrimidine-2,4,6-trione derivative, 1
TypeSmall organic molecule
Emp. Form.C23H18N2O4
Mol. Mass.386.4
SMILESCc1cc(C)cc(c1)N1C(=O)NC(=O)C(=Cc2ccc(o2)-c2ccccc2)C1=O