Reaction Details
TargetCalcitonin gene-related peptide type 1 receptor
LigandBDBM381649
Substrate/Competitorn/a
Meas. Tech.NATIVE RECEPTOR BINDING ASSA
Ki 0.055±n/a nM
Citation Bell, IMFraley, MEGallicchio, SNGinetti, AMitchell, HJPaone, DVStaas, DDWang, CZartman, CB Piperidinone carboxamide azaindane CGRP receptor antagonists US Patent US10272077 Publication Date 4/30/2019
 
Calcitonin gene-related peptide type 1 receptor
Name:Calcitonin gene-related peptide type 1 receptor
Type:Enzyme Catalytic Domain
Mol. Mass.:52980.45
Organism:Homo sapiens (Human)
Description:Q16602
Residue:461
BDBM381649
NameBDBM381649
Synonyms:US10272077, Example 17
TypeSmall organic molecule
Emp. Form.C32H31F2N5O3
Mol. Mass.571.617
SMILESC[C@@H]1[C@@H](C[C@H](NC(=O)c2cnc3C[C@]4(Cc3c2)C(=O)Nc2ncccc42)C(=O)N1CC1CCC1)c1cccc(F)c1F