Reaction Details
TargetPhosphatidylinositol 4,5-bisphosphate 3-kinase catalytic subunit alpha isoform
LigandBDBM25018
Substrate/CompetitorBDBM15235
Meas. Tech.Scintillation Proximity Assay
pH7.4±n/a
Temperature295.15±n/a K
IC50 2.5±n/a nM
Citation Hayakawa, MKawaguchi, KKaizawa, HKoizumi, TOhishi, TYamano, MOkada, MOhta, MTsukamoto, SRaynaud, FIParker, PWorkman, PWaterfield, MD Synthesis and biological evaluation of sulfonylhydrazone-substituted imidazo[1,2-a]pyridines as novel PI3 kinase p110alpha inhibitors. Bioorg Med Chem15:5837-44 (2007) 
 
Phosphatidylinositol 4,5-bisphosphate 3-kinase catalytic subunit alpha isoform
Name:Phosphatidylinositol 4,5-bisphosphate 3-kinase catalytic subunit alpha isoform
Type:Enzyme Subunit
Mol. Mass.:124294.87
Organism:Homo sapiens (Human)
Description:P42336
Residue:1068
BDBM25018
BDBM15235
NameBDBM25018
Synonyms:3-(4-morpholin-4-ylthieno[3,2-d]pyrimidin-2-yl)phenol CHEMBL541643 thienopyrimidine derivative, 1
TypeSmall organic molecule
Emp. Form.C16H15N3O2S
Mol. Mass.313.374
SMILESOc1cccc(c1)-c1nc(N2CCOCC2)c2sccc2n1