Reaction Details
TargetPhosphatidylinositol 4-phosphate 3-kinase C2 domain-containing subunit beta
LigandBDBM25036
Substrate/CompetitorBDBM15235
Meas. Tech.Scintillation Proximity Assay
pH7.4±n/a
Temperature295.15±n/a K
IC50 100±n/a nM
Citation Hayakawa, MKawaguchi, KKaizawa, HKoizumi, TOhishi, TYamano, MOkada, MOhta, MTsukamoto, SRaynaud, FIParker, PWorkman, PWaterfield, MD Synthesis and biological evaluation of sulfonylhydrazone-substituted imidazo[1,2-a]pyridines as novel PI3 kinase p110alpha inhibitors. Bioorg Med Chem15:5837-44 (2007) 
 
Phosphatidylinositol 4-phosphate 3-kinase C2 domain-containing subunit beta
Name:Phosphatidylinositol 4-phosphate 3-kinase C2 domain-containing subunit beta
Type:Enzyme
Mol. Mass.:184784.86
Organism:Homo sapiens (Human)
Description:O00750
Residue:1634
BDBM25036
BDBM15235
NameBDBM25036
Synonyms:CHEMBL393525 PIK-75, 1 imidazopyridine derivative, 8c
TypeSmall organic molecule
Emp. Form.C16H14BrN5O4S
Mol. Mass.452.282
SMILESCN(\N=C\c1cnc2ccc(Br)cn12)S(=O)(=O)c1cc(ccc1C)[N+]([O-])=O