Reaction Details
TargetHistone deacetylase 1
LigandBDBM25142
Substrate/CompetitorBDBM25143
Meas. Tech.HDAC Activity Assay
pH8±n/a
Temperature310.15±n/a K
IC50 44±n/a nM
Citation Jones, PAltamura, SDe Francesco, RPaz, OGKinzel, OMesiti, GMonteagudo, EPescatore, GRowley, MVerdirame, MSteinkühler, C A novel series of potent and selective ketone histone deacetylase inhibitors with antitumor activity in vivo. J Med Chem51:2350-3 (2008) 
 
Histone deacetylase 1
Name:Histone deacetylase 1
Type:Enzyme
Mol. Mass.:55090.27
Organism:Homo sapiens (Human)
Description:Q13547
Residue:482
BDBM25142
BDBM25143
NameBDBM25142
Synonyms:(3S,6S,9S,15aR)-9-[(2R)-butan-2-yl]-6-[(1-methoxy-1H-indol-3-yl)methyl]-3-(6-oxooctyl)-tetradecahydro-1H-pyrido[1,2-a][,,,]cyclododecane-1,4,7,10-tetrone | Apicidin
TypeSmall organic molecule
Emp. Form.C34H49N5O6
Mol. Mass.623.7828
SMILESCCC(C)[C@@H]1NC(=O)[C@H](Cc2cn(OC)c3ccccc23)NC(=O)[C@H](CCCCCC(=O)CC)NC(=O)[C@H]2CCCCN2C1=O