Reaction Details
TargetHistone deacetylase 1
LigandBDBM25147
Substrate/CompetitorBDBM25143
Meas. Tech.HDAC Activity Assay
pH8±n/a
Temperature310.15±n/a K
IC50 670±n/a nM
Citation Jones, PAltamura, SDe Francesco, RPaz, OGKinzel, OMesiti, GMonteagudo, EPescatore, GRowley, MVerdirame, MSteinkühler, C A novel series of potent and selective ketone histone deacetylase inhibitors with antitumor activity in vivo. J Med Chem51:2350-3 (2008) 
 
Histone deacetylase 1
Name:Histone deacetylase 1
Type:Enzyme
Mol. Mass.:55090.27
Organism:Homo sapiens (Human)
Description:Q13547
Residue:482
BDBM25147
BDBM25143
NameBDBM25147
Synonyms:N-[(1S)-1-(6-chloro-1H-1,3-benzodiazol-2-yl)-7-oxooctyl]-2-(5-methoxy-2-methyl-1H-indol-3-yl)acetamide | benzimidazole analogue, 18
TypeSmall organic molecule
Emp. Form.C27H31ClN4O3
Mol. Mass.495.013
SMILESCOc1ccc2[nH]c(C)c(CC(=O)N[C@@H](CCCCCC(C)=O)c3nc4ccc(Cl)cc4[nH]3)c2c1