Reaction Details
TargetHistone deacetylase 6
LigandBDBM19410
Substrate/CompetitorBDBM25143
Meas. Tech.HDAC Activity Assay
Temperature298.15±n/a K
IC50>10000±n/a nM
Commentsextracted
Citation Jones, PAltamura, SDe Francesco, RPaz, OGKinzel, OMesiti, GMonteagudo, EPescatore, GRowley, MVerdirame, MSteinkühler, C A novel series of potent and selective ketone histone deacetylase inhibitors with antitumor activity in vivo. J Med Chem51:2350-3 (2008) 
 
Histone deacetylase 6
Name:Histone deacetylase 6
Type:Chromatin regulator; hydrolase; repressor
Mol. Mass.:131381.51
Organism:Homo sapiens (Human)
Description:Q9UBN7
Residue:1215
BDBM19410
BDBM25143
NameBDBM19410
Synonyms:CHEMBL27759 US11377423, MS-275 US9265734, MS-275 benzamide-type inhibitor, 3 | pyridin-3-ylmethyl N-({4-[(2-aminophenyl)carbamoyl]phenyl}methyl)carbamate
TypeSmall organic molecule
Emp. Form.C21H20N4O3
Mol. Mass.376.4085
SMILESNc1ccccc1NC(=O)c1ccc(CNC(=O)OCc2cccnc2)cc1