Reaction Details
TargetHistone deacetylase 7
LigandBDBM25146
Substrate/CompetitorBDBM25149
Meas. Tech.HDAC Activity Assay
Temperature298.15±n/a K
IC50>10000±n/a nM
Commentsextracted
Citation Jones, PAltamura, SDe Francesco, RPaz, OGKinzel, OMesiti, GMonteagudo, EPescatore, GRowley, MVerdirame, MSteinkühler, C A novel series of potent and selective ketone histone deacetylase inhibitors with antitumor activity in vivo. J Med Chem51:2350-3 (2008) 
 
Histone deacetylase 7
Name:Histone deacetylase 7
Type:Chromatin regulator; hydrolase; repressor
Mol. Mass.:102942.62
Organism:Homo sapiens (Human)
Description:Q8WUI4
Residue:952
BDBM25146
BDBM25149
NameBDBM25146
Synonyms:2-(5-methoxy-2-methyl-1H-indol-3-yl)-N-[(1S)-7-oxo-1-(5-phenyl-1H-imidazol-2-yl)octyl]acetamide CHEMBL407959
TypeSmall organic molecule
Emp. Form.C29H34N4O3
Mol. Mass.486.6053
SMILESCOc1ccc2[nH]c(C)c(CC(=O)N[C@@H](CCCCCC(C)=O)c3nc(c[nH]3)-c3ccccc3)c2c1