Reaction Details
TargetHistone deacetylase 3
LigandBDBM25151
Substrate/CompetitorBDBM25143
Meas. Tech.HDAC Activity Assay
pH8±n/a
Temperature310.15±n/a K
IC50 120±n/a nM
Citation Jones, PAltamura, SDe Francesco, RGallinari, PLahm, ANeddermann, PRowley, MSerafini, SSteinkühler, C Probing the elusive catalytic activity of vertebrate class IIa histone deacetylases. Bioorg Med Chem Lett18:1814-9 (2008) 
 
Histone deacetylase 3
Name:Histone deacetylase 3
Type:Enzyme
Mol. Mass.:48829.55
Organism:Homo sapiens (Human)
Description:O15379
Residue:428
BDBM25151
BDBM25143
NameBDBM25151
Synonyms:9,9,9-trifluoro-8-oxo-N-(3-phenylphenyl)nonanamide trifluoromethyl ketone, 11
TypeSmall organic molecule
Emp. Form.C21H22F3NO2
Mol. Mass.377.4001
SMILESFC(F)(F)C(=O)CCCCCCC(=O)Nc1cccc(c1)-c1ccccc1