Reaction Details
TargetHistone deacetylase 4 [653-1084,H976Y]
LigandBDBM25150
Substrate/CompetitorBDBM25143
Meas. Tech.HDAC Activity Assay
pH7.5±n/a
Temperature310.15±n/a K
IC50 24±n/a nM
Citation Jones, PAltamura, SDe Francesco, RGallinari, PLahm, ANeddermann, PRowley, MSerafini, SSteinkühler, C Probing the elusive catalytic activity of vertebrate class IIa histone deacetylases. Bioorg Med Chem Lett18:1814-9 (2008) 
 
Histone deacetylase 4 [653-1084,H976Y]
Name:Histone deacetylase 4 [653-1084,H976Y]
Type:Catalytic domain
Mol. Mass.:46476.72
Organism:Homo sapiens (Human)
Description:His-tagged HDAC4 GOF(gain of function, H976Y) catalytic domains (T653-L1084) was expressed in E.coli and purified by Nickel-Chelation affinity chromatography and anion exchange (MonoQ) chromatography.
Residue:432
BDBM25150
BDBM25143
NameBDBM25150
Synonyms:(2E)-N-hydroxy-3-[3-(phenylsulfamoyl)phenyl]prop-2-enamide Belinostat PXD101
TypeSmall organic molecule
Emp. Form.C15H14N2O4S
Mol. Mass.318.348
SMILESONC(=O)\C=C\c1cccc(c1)S(=O)(=O)Nc1ccccc1