Reaction Details
TargetHistone deacetylase 6
LigandBDBM19149
Substrate/CompetitorBDBM25143
Meas. Tech.HDAC Activity Assay
Temperature298.15±n/a K
IC50 43±n/a nM
Commentsextracted
Citation Jones, PAltamura, SDe Francesco, RGallinari, PLahm, ANeddermann, PRowley, MSerafini, SSteinkühler, C Probing the elusive catalytic activity of vertebrate class IIa histone deacetylases. Bioorg Med Chem Lett18:1814-9 (2008) 
 
Histone deacetylase 6
Name:Histone deacetylase 6
Type:Chromatin regulator; hydrolase; repressor
Mol. Mass.:131381.51
Organism:Homo sapiens (Human)
Description:Q9UBN7
Residue:1215
BDBM19149
BDBM25143
NameBDBM19149
Synonyms:CHEMBL98 SAHA US10188756, Compound SAHA US11505523, Compound SAHA US9353061, SAHA US9695181, Vorinostat Zolinza suberoylanilide hydroxamic acid
TypeSmall organic molecule
Emp. Form.C14H20N2O3
Mol. Mass.264.3202
SMILESONC(=O)CCCCCCC(=O)Nc1ccccc1