Reaction Details
TargetHistone deacetylase 6
LigandBDBM25150
Substrate/CompetitorBDBM25143
Meas. Tech.HDAC Activity Assay
Temperature298.15±n/a K
IC50 15±n/a nM
Commentsextracted
Citation Jones, PAltamura, SDe Francesco, RGallinari, PLahm, ANeddermann, PRowley, MSerafini, SSteinkühler, C Probing the elusive catalytic activity of vertebrate class IIa histone deacetylases. Bioorg Med Chem Lett18:1814-9 (2008) 
 
Histone deacetylase 6
Name:Histone deacetylase 6
Type:Chromatin regulator; hydrolase; repressor
Mol. Mass.:131381.51
Organism:Homo sapiens (Human)
Description:Q9UBN7
Residue:1215
BDBM25150
BDBM25143
NameBDBM25150
Synonyms:(2E)-N-hydroxy-3-[3-(phenylsulfamoyl)phenyl]prop-2-enamide Belinostat PXD101
TypeSmall organic molecule
Emp. Form.C15H14N2O4S
Mol. Mass.318.348
SMILESONC(=O)\C=C\c1cccc(c1)S(=O)(=O)Nc1ccccc1