Reaction Details
TargetHistone deacetylase 3
LigandBDBM25153
Substrate/CompetitorBDBM25143
Meas. Tech.HDAC Activity Assay
Temperature298.15±n/a K
IC50 3500±n/a nM
Commentsextracted
Citation Jones, PBottomley, MJCarfí, ACecchetti, OFerrigno, FLo Surdo, POntoria, JMRowley, MScarpelli, RSchultz-Fademrecht, CSteinkühler, C 2-Trifluoroacetylthiophenes, a novel series of potent and selective class II histone deacetylase inhibitors. Bioorg Med Chem Lett18:3456-61 (2008) 
 
Histone deacetylase 3
Name:Histone deacetylase 3
Type:Enzyme
Mol. Mass.:48829.55
Organism:Homo sapiens (Human)
Description:O15379
Residue:428
BDBM25153
BDBM25143
NameBDBM25153
Synonyms:ethyl 5-(2,2,2-trifluoroacetyl)thiophene-2-carboxylate | thiophene derivative, 1
TypeSmall organic molecule
Emp. Form.C9H7F3O3S
Mol. Mass.252.21
SMILESCCOC(=O)c1ccc(s1)C(=O)C(F)(F)F