Reaction Details
TargetHistone deacetylase 4 [653-1084,H976Y]
LigandBDBM25154
Substrate/CompetitorBDBM25143
Meas. Tech.HDAC Activity Assay
Temperature298.15±n/a K
IC50 3100±n/a nM
Commentsextracted
Citation Jones, PBottomley, MJCarfí, ACecchetti, OFerrigno, FLo Surdo, POntoria, JMRowley, MScarpelli, RSchultz-Fademrecht, CSteinkühler, C 2-Trifluoroacetylthiophenes, a novel series of potent and selective class II histone deacetylase inhibitors. Bioorg Med Chem Lett18:3456-61 (2008) 
 
Histone deacetylase 4 [653-1084,H976Y]
Name:Histone deacetylase 4 [653-1084,H976Y]
Type:Catalytic domain
Mol. Mass.:46476.72
Organism:Homo sapiens (Human)
Description:His-tagged HDAC4 GOF(gain of function, H976Y) catalytic domains (T653-L1084) was expressed in E.coli and purified by Nickel-Chelation affinity chromatography and anion exchange (MonoQ) chromatography.
Residue:432
BDBM25154
BDBM25143
NameBDBM25154
Synonyms:ethyl 5-(2,2,2-trifluoroacetyl)furan-2-carboxylate | furan derivative, 2
TypeSmall organic molecule
Emp. Form.C9H7F3O4
Mol. Mass.236.1447
SMILESCCOC(=O)c1ccc(o1)C(=O)C(F)(F)F