Reaction Details
TargetHistone deacetylase 4 [653-1084,H976Y]
LigandBDBM25156
Substrate/CompetitorBDBM25143
Meas. Tech.HDAC Activity Assay
Temperature298.15±n/a K
IC50 180±n/a nM
Commentsextracted
Citation Jones, PBottomley, MJCarfí, ACecchetti, OFerrigno, FLo Surdo, POntoria, JMRowley, MScarpelli, RSchultz-Fademrecht, CSteinkühler, C 2-Trifluoroacetylthiophenes, a novel series of potent and selective class II histone deacetylase inhibitors. Bioorg Med Chem Lett18:3456-61 (2008) 
 
Histone deacetylase 4 [653-1084,H976Y]
Name:Histone deacetylase 4 [653-1084,H976Y]
Type:Catalytic domain
Mol. Mass.:46476.72
Organism:Homo sapiens (Human)
Description:His-tagged HDAC4 GOF(gain of function, H976Y) catalytic domains (T653-L1084) was expressed in E.coli and purified by Nickel-Chelation affinity chromatography and anion exchange (MonoQ) chromatography.
Residue:432
BDBM25156
BDBM25143
NameBDBM25156
Synonyms:N-(2-phenylethyl)-5-(2,2,2-trifluoroacetyl)thiophene-2-carboxamide | thiophene derivative, 3b
TypeSmall organic molecule
Emp. Form.C15H12F3NO2S
Mol. Mass.327.321
SMILESFC(F)(F)C(=O)c1ccc(s1)C(=O)NCCc1ccccc1