Reaction Details
TargetHistone deacetylase 4 [653-1084,H976Y]
LigandBDBM25162
Substrate/CompetitorBDBM25143
Meas. Tech.HDAC Activity Assay
Temperature298.15±n/a K
IC50 300±n/a nM
Commentsextracted
Citation Jones, PBottomley, MJCarfí, ACecchetti, OFerrigno, FLo Surdo, POntoria, JMRowley, MScarpelli, RSchultz-Fademrecht, CSteinkühler, C 2-Trifluoroacetylthiophenes, a novel series of potent and selective class II histone deacetylase inhibitors. Bioorg Med Chem Lett18:3456-61 (2008) 
 
Histone deacetylase 4 [653-1084,H976Y]
Name:Histone deacetylase 4 [653-1084,H976Y]
Type:Catalytic domain
Mol. Mass.:46476.72
Organism:Homo sapiens (Human)
Description:His-tagged HDAC4 GOF(gain of function, H976Y) catalytic domains (T653-L1084) was expressed in E.coli and purified by Nickel-Chelation affinity chromatography and anion exchange (MonoQ) chromatography.
Residue:432
BDBM25162
BDBM25143
NameBDBM25162
Synonyms:1-[5-(2,3-dihydro-1H-indol-1-ylcarbonyl)thiophen-2-yl]-2,2,2-trifluoroethan-1-one thiophene derivative, 3h
TypeSmall organic molecule
Emp. Form.C15H10F3NO2S
Mol. Mass.325.306
SMILESFC(F)(F)C(=O)c1ccc(s1)C(=O)N1CCc2ccccc12