Reaction Details
TargetHistone deacetylase 4 [653-1084,H976Y]
LigandBDBM25164
Substrate/CompetitorBDBM25143
Meas. Tech.HDAC Activity Assay
Temperature298.15±n/a K
IC50 370±n/a nM
Commentsextracted
Citation Jones, PBottomley, MJCarfí, ACecchetti, OFerrigno, FLo Surdo, POntoria, JMRowley, MScarpelli, RSchultz-Fademrecht, CSteinkühler, C 2-Trifluoroacetylthiophenes, a novel series of potent and selective class II histone deacetylase inhibitors. Bioorg Med Chem Lett18:3456-61 (2008) 
 
Histone deacetylase 4 [653-1084,H976Y]
Name:Histone deacetylase 4 [653-1084,H976Y]
Type:Catalytic domain
Mol. Mass.:46476.72
Organism:Homo sapiens (Human)
Description:His-tagged HDAC4 GOF(gain of function, H976Y) catalytic domains (T653-L1084) was expressed in E.coli and purified by Nickel-Chelation affinity chromatography and anion exchange (MonoQ) chromatography.
Residue:432
BDBM25164
BDBM25143
NameBDBM25164
Synonyms:2,2,2-trifluoro-1-[5-({3-phenyl-5H,6H,7H,8H-imidazo[1,2-a]pyrazin-7-yl}carbonyl)thiophen-2-yl]ethan-1-one thiophene derivative, 3j
TypeSmall organic molecule
Emp. Form.C19H14F3N3O2S
Mol. Mass.405.394
SMILESFC(F)(F)C(=O)c1ccc(s1)C(=O)N1CCn2c(C1)ncc2-c1ccccc1