Reaction Details
TargetHistone deacetylase 4 [653-1084,H976Y]
LigandBDBM25175
Substrate/CompetitorBDBM25143
Meas. Tech.HDAC Activity Assay
Temperature298.15±n/a K
IC50 1100±n/a nM
Commentsextracted
Citation Jones, PBottomley, MJCarfí, ACecchetti, OFerrigno, FLo Surdo, POntoria, JMRowley, MScarpelli, RSchultz-Fademrecht, CSteinkühler, C 2-Trifluoroacetylthiophenes, a novel series of potent and selective class II histone deacetylase inhibitors. Bioorg Med Chem Lett18:3456-61 (2008) 
 
Histone deacetylase 4 [653-1084,H976Y]
Name:Histone deacetylase 4 [653-1084,H976Y]
Type:Catalytic domain
Mol. Mass.:46476.72
Organism:Homo sapiens (Human)
Description:His-tagged HDAC4 GOF(gain of function, H976Y) catalytic domains (T653-L1084) was expressed in E.coli and purified by Nickel-Chelation affinity chromatography and anion exchange (MonoQ) chromatography.
Residue:432
BDBM25175
BDBM25143
NameBDBM25175
Synonyms:1-(5-{[benzyl(methyl)amino]methyl}thiophen-2-yl)-2,2,2-trifluoroethan-1-one | thiophene derivative, 19c
TypeSmall organic molecule
Emp. Form.C15H14F3NOS
Mol. Mass.313.338
SMILESCN(Cc1ccc(s1)C(=O)C(F)(F)F)Cc1ccccc1