Reaction Details
TargetHistone deacetylase 4 [653-1084,H976Y]
LigandBDBM25181
Substrate/CompetitorBDBM25143
Meas. Tech.HDAC Activity Assay
Temperature298.15±n/a K
IC50 2400±n/a nM
Commentsextracted
Citation Jones, PBottomley, MJCarfí, ACecchetti, OFerrigno, FLo Surdo, POntoria, JMRowley, MScarpelli, RSchultz-Fademrecht, CSteinkühler, C 2-Trifluoroacetylthiophenes, a novel series of potent and selective class II histone deacetylase inhibitors. Bioorg Med Chem Lett18:3456-61 (2008) 
 
Histone deacetylase 4 [653-1084,H976Y]
Name:Histone deacetylase 4 [653-1084,H976Y]
Type:Catalytic domain
Mol. Mass.:46476.72
Organism:Homo sapiens (Human)
Description:His-tagged HDAC4 GOF(gain of function, H976Y) catalytic domains (T653-L1084) was expressed in E.coli and purified by Nickel-Chelation affinity chromatography and anion exchange (MonoQ) chromatography.
Residue:432
BDBM25181
BDBM25143
NameBDBM25181
Synonyms:N-(cyclohexylmethyl)-4-(2,2,2-trifluoroacetyl)thiophene-2-carboxamide | thiophene derivative, 27g
TypeSmall organic molecule
Emp. Form.C14H16F3NO2S
Mol. Mass.319.343
SMILESFC(F)(F)C(=O)c1csc(c1)C(=O)NCC1CCCCC1