Reaction Details
TargetATP phosphoribosyltransferase
LigandBDBM25316
Substrate/CompetitorBDBM25315
Meas. Tech.Enzyme Inhibition Assay
pH8.5±n/a
Temperature295.15±n/a K
IC50 6000±n/a nM
Comments71% inhibition @ 10 uM.
Citation Cho, YIoerger, TRSacchettini, JC Discovery of novel nitrobenzothiazole inhibitors for Mycobacterium tuberculosis ATP phosphoribosyl transferase (HisG) through virtual screening. J Med Chem51:5984-92 (2008) 
 
ATP phosphoribosyltransferase
Name:ATP phosphoribosyltransferase
Type:Glycosyltransferase
Mol. Mass.:30473.85
Organism:Mycobacterium tuberculosis
Description:n/a
Residue:284
BDBM25316
BDBM25315
NameBDBM25316
Synonyms:ChemBridge nitrobenzothiazole, 6 | N-(6-nitro-1,3-benzothiazol-2-yl)-3-phenyl-3-(phenylformamido)propanamide
TypeSmall organic molecule
Emp. Form.C23H18N4O4S
Mol. Mass.446.478
SMILES[O-][N+](=O)c1ccc2nc(NC(=O)CC(NC(=O)c3ccccc3)c3ccccc3)sc2c1