Reaction Details
TargetEnoyl-ACP reductase
LigandBDBM8726
Substrate/CompetitorBDBM8737
Meas. Tech.PfENR Enzymatic Inhibition Assay
pH7.9±n/a
Temperature298.15±n/a K
IC50 73±21 nM
Citation Freundlich, JSWang, FTsai, HCKuo, MShieh, HMAnderson, JWNkrumah, LJValderramos, JCYu, MKumar, TRValderramos, SGJacobs, WRSchiehser, GAJacobus, DPFidock, DASacchettini, JC X-ray structural analysis of Plasmodium falciparum enoyl acyl carrier protein reductase as a pathway toward the optimization of triclosan antimalarial efficacy. J Biol Chem282:25436-44 (2007) 
 
Enoyl-ACP reductase
Name:Enoyl-ACP reductase
Type:Enzyme
Mol. Mass.:49844.02
Organism:Plasmodium falciparum
Description:Q9BJJ9
Residue:432
BDBM8726
BDBM8737
NameBDBM8726
Synonyms:5-chloro-2-(2,4-dichlorophenoxy)phenol TCL US20230414581, Compound 35
TypeSmall organic molecule
Emp. Form.C12H7Cl3O2
Mol. Mass.289.542
SMILESOc1cc(Cl)ccc1Oc1ccc(Cl)cc1Cl