Reaction Details
TargetSteroid 17-alpha-hydroxylase/17,20 lyase
LigandBDBM25453
Substrate/CompetitorBDBM8903
Meas. Tech.CYP17 Inhibition Assay
pH7.4±n/a
Temperature310.15±n/a K
IC50 233±n/a nM
Citation Pinto-Bazurco Mendieta, MANegri, MJagusch, CMüller-Vieira, ULauterbach, THartmann, RW Synthesis, biological evaluation, and molecular modeling of abiraterone analogues: novel CYP17 inhibitors for the treatment of prostate cancer. J Med Chem51:5009-18 (2008) 
 
Steroid 17-alpha-hydroxylase/17,20 lyase
Name:Steroid 17-alpha-hydroxylase/17,20 lyase
Type:Enzyme
Mol. Mass.:57382.42
Organism:Homo sapiens (Human)
Description:E.coli expressing human CYP17
Residue:508
BDBM25453
BDBM8903
NameBDBM25453
Synonyms:4-[5-(4-fluorophenyl)-2,3-dihydro-1H-inden-1-yl]pyridine | Abiraterone mimetic, 16
TypeSmall organic molecule
Emp. Form.C20H16FN
Mol. Mass.289.3461
SMILESFc1ccc(cc1)-c1ccc2C(CCc2c1)c1ccncc1