Reaction Details
TargetSteroid 17-alpha-hydroxylase/17,20 lyase
LigandBDBM25458
Substrate/CompetitorBDBM8903
Meas. Tech.CYP17 Inhibition Assay
pH7.4±n/a
Temperature310.15±n/a K
IC50 72±n/a nM
Citation Pinto-Bazurco Mendieta, MANegri, MJagusch, CMüller-Vieira, ULauterbach, THartmann, RW Synthesis, biological evaluation, and molecular modeling of abiraterone analogues: novel CYP17 inhibitors for the treatment of prostate cancer. J Med Chem51:5009-18 (2008) 
 
Steroid 17-alpha-hydroxylase/17,20 lyase
Name:Steroid 17-alpha-hydroxylase/17,20 lyase
Type:Enzyme
Mol. Mass.:57382.42
Organism:Homo sapiens (Human)
Description:E.coli expressing human CYP17
Residue:508
BDBM25458
BDBM8903
NameBDBM25458
Synonyms:(1S,2R,5S,10R,11S,15S)-2,15-dimethyl-14-(pyridin-3-yl)tetracyclo[8.7.0.0^{2,7}.0^{11,15}]heptadeca-7,13-dien-5-ol Abiraterone CHEMBL254328 US9611270, Example 5, abiraterone
Typesteroidal compound
Emp. Form.C24H31NO
Mol. Mass.349.509
SMILES[H][C@@]12CC=C(c3cccnc3)[C@@]1(C)CC[C@@]1([H])[C@@]2([H])CC=C2C[C@@H](O)CC[C@]12C