Reaction Details
TargetAdenosine 5'-phosphosulfate reductase
LigandBDBM25465
Substrate/CompetitorBDBM25461
Meas. Tech.Determination of Dissociation Constant (Kd)
pH7.5±n/a
Temperature303.15±n/a K
Kd 127190±n/a nM
Citation Cosconati, SHong, JANovellino, ECarroll, KSGoodsell, DSOlson, AJ Structure-based virtual screening and biological evaluation of Mycobacterium tuberculosis adenosine 5'-phosphosulfate reductase inhibitors. J Med Chem51:6627-30 (2008) 
 
Adenosine 5'-phosphosulfate reductase
Name:Adenosine 5'-phosphosulfate reductase
Type:Oxidoreductase
Mol. Mass.:27417.08
Organism:Mycobacterium tuberculosis
Description:Proteins were expressed by transforming a reductase-containing plasmid into E. coli cells.
Residue:254
BDBM25465
BDBM25461
NameBDBM25465
Synonyms:(1R,2R,5S,6S,10S,13S,15R)-5-acetyl-13-hydroxy-6,10-dimethylpentacyclo[13.2.2.0^{1,9}.0^{2,6}.0^{10,15}]nonadeca-8,18-diene-16,17-dicarboxylic acid | NSC9746
TypeSmall organic molecule
Emp. Form.C25H32O6
Mol. Mass.428.518
SMILES[H][C@@]12CC[C@H](C(C)=O)[C@@]1(C)CC=C1[C@@]3(C)CC[C@H](O)C[C@]33C=C[C@]21C(C3C(O)=O)C(O)=O