Reaction Details
TargetBeta-2 adrenergic receptor
LigandBDBM25746
Substrate/CompetitorBDBM25747
Meas. Tech.3H-CGP 12177 Whole Cell Binding Assay
Kd 776±n/a nM
Citation Baker, JG The selectivity of beta-adrenoceptor antagonists at the human beta1, beta2 and beta3 adrenoceptors. Br J Pharmacol144:317-22 (2005) 
 
Beta-2 adrenergic receptor
Name:Beta-2 adrenergic receptor
Type:n/a
Mol. Mass.:46461.69
Organism:Homo sapiens (Human)
Description:P07550
Residue:413
BDBM25746
BDBM25747
NameBDBM25746
Synonyms:2-hydroxy-5-{2-[(2-hydroxy-3-{4-[1-methyl-4-(trifluoromethyl)-1H-imidazol-2-yl]phenoxy}propyl)amino]ethoxy}benzamide; methanesulfonic acid CGP-20712A | cid_2685
TypeSmall organic molecule
Emp. Form.C23H25F3N4O5
Mol. Mass.494.4636
SMILESCn1cc(nc1-c1ccc(OCC(O)CNCCOc2ccc(O)c(c2)C(N)=O)cc1)C(F)(F)F