Reaction Details
TargetBeta-2 adrenergic receptor
LigandBDBM25765
Substrate/CompetitorBDBM25747
Meas. Tech.3H-CGP 12177 Whole Cell Binding Assay
Kd 0.14±n/a nM
Citation Baker, JG The selectivity of beta-adrenoceptor antagonists at the human beta1, beta2 and beta3 adrenoceptors. Br J Pharmacol144:317-22 (2005) 
 
Beta-2 adrenergic receptor
Name:Beta-2 adrenergic receptor
Type:n/a
Mol. Mass.:46461.69
Organism:Homo sapiens (Human)
Description:P07550
Residue:413
BDBM25765
BDBM25747
NameBDBM25765
Synonyms:Bupranolol Ophtorenin | tert-butyl[3-(2-chloro-5-methylphenoxy)-2-hydroxypropyl]amine
TypeSmall organic molecule
Emp. Form.C14H22ClNO2
Mol. Mass.271.783
SMILESCc1ccc(Cl)c(OCC(O)CNC(C)(C)C)c1