Reaction Details
TargetBeta-2 adrenergic receptor
LigandBDBM25766
Substrate/CompetitorBDBM25747
Meas. Tech.3H-CGP 12177 Whole Cell Binding Assay
Kd 2.5±n/a nM
Citation Baker, JG The selectivity of beta-adrenoceptor antagonists at the human beta1, beta2 and beta3 adrenoceptors. Br J Pharmacol144:317-22 (2005) 
 
Beta-2 adrenergic receptor
Name:Beta-2 adrenergic receptor
Type:n/a
Mol. Mass.:46461.69
Organism:Homo sapiens (Human)
Description:P07550
Residue:413
BDBM25766
BDBM25747
NameBDBM25766
Synonyms:(2R,3S)-5-[3-(tert-butylamino)-2-hydroxypropoxy]-1,2,3,4-tetrahydronaphthalene-2,3-diol Corgard Solgol | cid_39147
TypeSmall organic molecule
Emp. Form.C17H27NO4
Mol. Mass.309.4006
SMILESCC(C)(C)NCC(O)COc1cccc2C[C@@H](O)[C@@H](O)Cc12