Reaction Details
TargetLanosterol 14-alpha demethylase
LigandBDBM25810
Substrate/CompetitorBDBM10852
Meas. Tech.Ligand Binding Assay
pH7.5±n/a
Temperature310.15±n/a K
Kd 5000±n/a nM
Citation Podust, LMvon Kries, JPEddine, ANKim, YYermalitskaya, LVKuehne, ROuellet, HWarrier, TAlteköster, MLee, JSRademann, JOschkinat, HKaufmann, SHWaterman, MR Small-molecule scaffolds for CYP51 inhibitors identified by high-throughput screening and defined by X-ray crystallography. Antimicrob Agents Chemother51:3915-23 (2007) 
 
Lanosterol 14-alpha demethylase
Name:Lanosterol 14-alpha demethylase
Type:Monooxygenase; oxidoreductase
Mol. Mass.:50869.67
Organism:Mycobacterium tuberculosis (strain CDC 1551 / Oshkosh)
Description:P9WPP8
Residue:451
BDBM25810
BDBM10852
NameBDBM25810
Synonyms:2-phenyl-N-(pyridin-4-yl)butanamide Compound 3937-0152 (EPBA) | JMC522846 Compound 5
TypeSmall organic molecule
Emp. Form.C15H16N2O
Mol. Mass.240.3003
SMILESCCC(C(=O)Nc1ccncc1)c1ccccc1